Reaction Details
TargetCarbonic anhydrase 4
LigandBDBM50205567
Substrate/Competitorn/a
Meas. Tech.ChEMBL_1628396 (CHEMBL3870981)
Ki>10000±n/a nM
Citation Esirden, ITanç, MSupuran, CTKaya, M Microwave assisted synthesis of novel tetrazole/sulfonamide derivatives based on octahydroacridine, xanthene and chromene skeletons as inhibitors of the carbonic anhydrases isoforms I, II, IV and VII. Bioorg Med Chem Lett27:86-89 (2017) 
 
Carbonic anhydrase 4
Name:Carbonic anhydrase 4
Type:Enzyme
Mol. Mass.:35037.98
Organism:Homo sapiens (Human)
Description:P22748
Residue:312
BDBM50205567
NameBDBM50205567
Synonyms:CHEMBL3910545
TypeSmall organic molecule
Emp. Form.C8H6N4O
Mol. Mass.174.1594
SMILESO=Cc1ccc(cc1)-c1nnn[nH]1