Reaction Details
TargetCarbonic anhydrase 1
LigandBDBM50205568
Substrate/Competitorn/a
Meas. Tech.ChEMBL_1628394 (CHEMBL3870979)
Ki 64±n/a nM
Citation Esirden, ITanç, MSupuran, CTKaya, M Microwave assisted synthesis of novel tetrazole/sulfonamide derivatives based on octahydroacridine, xanthene and chromene skeletons as inhibitors of the carbonic anhydrases isoforms I, II, IV and VII. Bioorg Med Chem Lett27:86-89 (2017) 
 
Carbonic anhydrase 1
Name:Carbonic anhydrase 1
Type:Enzyme
Mol. Mass.:28873.37
Organism:Homo sapiens (Human)
Description:P00915
Residue:261
BDBM50205568
NameBDBM50205568
Synonyms:CHEMBL3937384
TypeSmall organic molecule
Emp. Form.C37H37N7O5S
Mol. Mass.691.799
SMILESCC1(C)CC(=O)C2=C(C1)N(C1=C(C2c2cccc(c2)-c2nnn[nH]2)C(=O)CC(C)(C)C1)c1ccc(cc1)C(=O)Nc1ccc(cc1)S(N)(=O)=O