Reaction Details
TargetKallikrein-7
LigandBDBM50205620
Substrate/Competitorn/a
Meas. Tech.ChEMBL_1628501 (CHEMBL3871086)
IC50 249000±n/a nM
Citation Barros, TGSantos, JANde Souza, BEGSodero, ACRde Souza, AMTda Silva, DPRodrigues, CRPinheiro, SDias, LRSAbrahim-Vieira, BPuzer, LMuri, EMF Discovery of a new isomannide-based peptidomimetic synthetized by Ugi multicomponent reaction as human tissue kallikrein 1 inhibitor. Bioorg Med Chem Lett27:314-318 (2017) 
 
Kallikrein-7
Name:Kallikrein-7
Type:PROTEIN
Mol. Mass.:27535.05
Organism:Homo sapiens (Human)
Description:ChEMBL_1469257
Residue:253
BDBM50205620
NameBDBM50205620
Synonyms:CHEMBL3943212
TypeSmall organic molecule
Emp. Form.C31H40N2O6
Mol. Mass.536.6591
SMILES[H][C@]12OC[C@H](N(C(=O)Cc3ccc(O)cc3)C(C)(C)C(=O)NC3CCCCC3)[C@@]1([H])OC[C@H]2OCc1ccccc1