Reaction Details
TargetKallikrein-1
LigandBDBM50205624
Substrate/Competitorn/a
Meas. Tech.ChEMBL_1628500 (CHEMBL3871085)
IC50 125000±n/a nM
Citation Barros, TGSantos, JANde Souza, BEGSodero, ACRde Souza, AMTda Silva, DPRodrigues, CRPinheiro, SDias, LRSAbrahim-Vieira, BPuzer, LMuri, EMF Discovery of a new isomannide-based peptidomimetic synthetized by Ugi multicomponent reaction as human tissue kallikrein 1 inhibitor. Bioorg Med Chem Lett27:314-318 (2017) 
 
Kallikrein-1
Name:Kallikrein-1
Type:Enzyme
Mol. Mass.:28874.69
Organism:Homo sapiens (Human)
Description:P06870
Residue:262
BDBM50205624
NameBDBM50205624
Synonyms:CHEMBL3963267
TypeSmall organic molecule
Emp. Form.C32H42N2O6
Mol. Mass.550.6857
SMILES[H][C@]12OC[C@H](N(C(=O)Cc3ccc(OC)cc3)C(C)(C)C(=O)NC3CCCCC3)[C@@]1([H])OC[C@H]2OCc1ccccc1