Reaction Details
TargetKallikrein-7
LigandBDBM50205625
Substrate/Competitorn/a
Meas. Tech.ChEMBL_1628501 (CHEMBL3871086)
IC50 133000±n/a nM
Citation Barros, TGSantos, JANde Souza, BEGSodero, ACRde Souza, AMTda Silva, DPRodrigues, CRPinheiro, SDias, LRSAbrahim-Vieira, BPuzer, LMuri, EMF Discovery of a new isomannide-based peptidomimetic synthetized by Ugi multicomponent reaction as human tissue kallikrein 1 inhibitor. Bioorg Med Chem Lett27:314-318 (2017) 
 
Kallikrein-7
Name:Kallikrein-7
Type:PROTEIN
Mol. Mass.:27535.05
Organism:Homo sapiens (Human)
Description:ChEMBL_1469257
Residue:253
BDBM50205625
NameBDBM50205625
Synonyms:CHEMBL3901491
TypeSmall organic molecule
Emp. Form.C42H58N4O8
Mol. Mass.746.9319
SMILES[H][C@]12OC[C@H](N(C(=O)Cc3ccc(O)cc3)C(C)(C)C(=O)NC3CCCCC3)[C@@]1([H])OC[C@@H]2N(C(=O)Cc1ccc(O)cc1)C(C)(C)C(=O)NC1CCCCC1