Reaction Details
TargetKallikrein-1
LigandBDBM50205621
Substrate/Competitorn/a
Meas. Tech.ChEMBL_1628500 (CHEMBL3871085)
IC50 400000±n/a nM
Citation Barros, TGSantos, JANde Souza, BEGSodero, ACRde Souza, AMTda Silva, DPRodrigues, CRPinheiro, SDias, LRSAbrahim-Vieira, BPuzer, LMuri, EMF Discovery of a new isomannide-based peptidomimetic synthetized by Ugi multicomponent reaction as human tissue kallikrein 1 inhibitor. Bioorg Med Chem Lett27:314-318 (2017) 
 
Kallikrein-1
Name:Kallikrein-1
Type:Enzyme
Mol. Mass.:28874.69
Organism:Homo sapiens (Human)
Description:P06870
Residue:262
BDBM50205621
NameBDBM50205621
Synonyms:CHEMBL3891631
TypeSmall organic molecule
Emp. Form.C30H38N2O5
Mol. Mass.506.6331
SMILES[H][C@]12OC[C@H](N(C(=O)c3ccccc3)C(C)(C)C(=O)NC3CCCCC3)[C@@]1([H])OC[C@H]2OCc1ccccc1