Reaction Details
TargetHistone-lysine N-methyltransferase EZH1
LigandBDBM50205627
Substrate/Competitorn/a
Meas. Tech.ChEMBL_1628507 (CHEMBL3871092)
IC50 1560±n/a nM
Citation Ansari, ASatalkar, SPatil, VShete, ASKaur, SGupta, ASingh, SRaja, MSeverance, DLBernales, SChakravarty, SHung, DTPham, SMHerrera, FJRai, R Novel 3-methylindoline inhibitors of EZH2: Design, synthesis and SAR. Bioorg Med Chem Lett27:217-222 (2017) 
 
Histone-lysine N-methyltransferase EZH1
Name:Histone-lysine N-methyltransferase EZH1
Type:Protein
Mol. Mass.:85285.34
Organism:Homo sapiens (Human)
Description:Q92800
Residue:747
BDBM50205627
NameBDBM50205627
Synonyms:CHEMBL3914517
TypeSmall organic molecule
Emp. Form.C36H42N6O3
Mol. Mass.606.7571
SMILESCC1CN(C2CCOCC2)c2cc(cc(C(=O)NCc3c(C)cc(C)[nH]c3=O)c12)-c1cnc(N2CCNCC2)c2ccccc12