Reaction Details
TargetHistone-lysine N-methyltransferase EZH2
LigandBDBM50205629
Substrate/Competitorn/a
Meas. Tech.ChEMBL_1628509 (CHEMBL3871094)
IC50 4140±n/a nM
Citation Ansari, ASatalkar, SPatil, VShete, ASKaur, SGupta, ASingh, SRaja, MSeverance, DLBernales, SChakravarty, SHung, DTPham, SMHerrera, FJRai, R Novel 3-methylindoline inhibitors of EZH2: Design, synthesis and SAR. Bioorg Med Chem Lett27:217-222 (2017) 
 
Histone-lysine N-methyltransferase EZH2
Name:Histone-lysine N-methyltransferase EZH2
Type:Protein
Mol. Mass.:85367.84
Organism:Homo sapiens (Human)
Description:Q15910
Residue:746
BDBM50205629
NameBDBM50205629
Synonyms:CHEMBL3905192
TypeSmall organic molecule
Emp. Form.C32H40N4O3
Mol. Mass.528.685
SMILESCC(C)N1CC(C)c2c1cc(cc2C(=O)NCc1c(C)cc(C)[nH]c1=O)-c1ccc(CN2CCOCC2)cc1