Reaction Details
TargetTryptophan 2,3-dioxygenase
LigandBDBM50205740
Substrate/Competitorn/a
Meas. Tech.ChEMBL_1628532 (CHEMBL3871117)
IC50 71±n/a nM
Citation Abdel-Magid, AF Targeting the Inhibition of Tryptophan 2,3-Dioxygenase (TDO-2) for Cancer Treatment. ACS Med Chem Lett8:11-13 (2017) 
 
Tryptophan 2,3-dioxygenase
Name:Tryptophan 2,3-dioxygenase
Type:PROTEIN
Mol. Mass.:47874.48
Organism:Homo sapiens (Human)
Description:ChEMBL_825691
Residue:406
BDBM50205740
NameBDBM50205740
Synonyms:CHEMBL3937796
TypeSmall organic molecule
Emp. Form.C20H20FN3O3S
Mol. Mass.401.455
SMILESCNC(=O)CCN1C(C)c2cc(ccc2S1(=O)=O)-c1c[nH]c2cc(F)ccc12