Reaction Details
TargetTryptophan 2,3-dioxygenase
LigandBDBM50205741
Substrate/Competitorn/a
Meas. Tech.ChEMBL_1628532 (CHEMBL3871117)
IC50 26±n/a nM
Citation Abdel-Magid, AF Targeting the Inhibition of Tryptophan 2,3-Dioxygenase (TDO-2) for Cancer Treatment. ACS Med Chem Lett8:11-13 (2017) 
 
Tryptophan 2,3-dioxygenase
Name:Tryptophan 2,3-dioxygenase
Type:PROTEIN
Mol. Mass.:47874.48
Organism:Homo sapiens (Human)
Description:ChEMBL_825691
Residue:406
BDBM50205741
NameBDBM50205741
Synonyms:CHEMBL3947656
TypeSmall organic molecule
Emp. Form.C18H16FN3O3S
Mol. Mass.373.401
SMILESCC1N(CC(N)=O)S(=O)(=O)c2ccc(cc12)-c1c[nH]c2cc(F)ccc12