Reaction Details
TargetTryptophan 2,3-dioxygenase
LigandBDBM50205803
Substrate/Competitorn/a
Meas. Tech.ChEMBL_1628532 (CHEMBL3871117)
IC50 58±n/a nM
Citation Abdel-Magid, AF Targeting the Inhibition of Tryptophan 2,3-Dioxygenase (TDO-2) for Cancer Treatment. ACS Med Chem Lett8:11-13 (2017) 
 
Tryptophan 2,3-dioxygenase
Name:Tryptophan 2,3-dioxygenase
Type:PROTEIN
Mol. Mass.:47874.48
Organism:Homo sapiens (Human)
Description:ChEMBL_825691
Residue:406
BDBM50205803
NameBDBM50205803
Synonyms:CHEMBL3975938
TypeSmall organic molecule
Emp. Form.C21H20FN3O4S
Mol. Mass.429.465
SMILESCC1N(CC2(C)COC(=O)N2)S(=O)(=O)c2ccc(cc12)-c1c[nH]c2cc(F)ccc12