Reaction Details
TargetPlatelet-activating factor acetylhydrolase
LigandBDBM50205805
Substrate/Competitorn/a
Meas. Tech.ChEMBL_1628544 (CHEMBL3871129)
IC50 0.251189±n/a nM
Citation Measom, NDDown, KDHirst, DJJamieson, CManas, ESPatel, VKSomers, DO Investigation of a Bicyclo[1.1.1]pentane as a Phenyl Replacement within an LpPLA ACS Med Chem Lett8:43-48 (2017) 
 
Platelet-activating factor acetylhydrolase
Name:Platelet-activating factor acetylhydrolase
Type:PROTEIN
Mol. Mass.:50084.41
Organism:Homo sapiens (Human)
Description:ChEMBL_156212
Residue:441
BDBM50205805
NameBDBM50205805
Synonyms:Rilapladib | SB-659032
TypeSmall organic molecule
Emp. Form.C40H38F5N3O3S
Mol. Mass.735.805
SMILESCOCCN1CCC(CC1)N(Cc1ccc(cc1)-c1ccc(cc1)C(F)(F)F)C(=O)Cn1c(SCc2cccc(F)c2F)cc(=O)c2ccccc12