Reaction Details
TargetMacrophage migration inhibitory factor
LigandBDBM50206086
Substrate/Competitorn/a
Meas. Tech.ChEMBL_1628621 (CHEMBL3871206)
Ki 270±n/a nM
Citation Cisneros, JARobertson, MJMercado, BQJorgensen, WL Systematic Study of Effects of Structural Modifications on the Aqueous Solubility of Drug-like Molecules. ACS Med Chem Lett8:124-127 (2017) 
 
Macrophage migration inhibitory factor
Name:Macrophage migration inhibitory factor
Type:Enzyme
Mol. Mass.:12478.18
Organism:Homo sapiens (Human)
Description:P14174
Residue:115
BDBM50206086
NameBDBM50206086
Synonyms:CHEMBL3943378
TypeSmall organic molecule
Emp. Form.C23H22N4O3
Mol. Mass.402.4458
SMILESOc1ccc(cc1)-n1cc(nn1)-c1ccc2cc(OCC3CCCCO3)ccc2n1