Reaction Details
TargetMacrophage migration inhibitory factor
LigandBDBM50206088
Substrate/Competitorn/a
Meas. Tech.ChEMBL_1628621 (CHEMBL3871206)
Ki 1370±n/a nM
Citation Cisneros, JARobertson, MJMercado, BQJorgensen, WL Systematic Study of Effects of Structural Modifications on the Aqueous Solubility of Drug-like Molecules. ACS Med Chem Lett8:124-127 (2017) 
 
Macrophage migration inhibitory factor
Name:Macrophage migration inhibitory factor
Type:Enzyme
Mol. Mass.:12478.18
Organism:Homo sapiens (Human)
Description:P14174
Residue:115
BDBM50206088
NameBDBM50206088
Synonyms:CHEMBL3945050
TypeSmall organic molecule
Emp. Form.C19H14N4O3
Mol. Mass.346.3395
SMILESOC(=O)COc1ccc2nc(ccc2c1)-c1cn(nn1)-c1ccccc1