Reaction Details
TargetMacrophage migration inhibitory factor
LigandBDBM50206094
Substrate/Competitorn/a
Meas. Tech.ChEMBL_1628621 (CHEMBL3871206)
Ki 144±n/a nM
Citation Cisneros, JARobertson, MJMercado, BQJorgensen, WL Systematic Study of Effects of Structural Modifications on the Aqueous Solubility of Drug-like Molecules. ACS Med Chem Lett8:124-127 (2017) 
 
Macrophage migration inhibitory factor
Name:Macrophage migration inhibitory factor
Type:Enzyme
Mol. Mass.:12478.18
Organism:Homo sapiens (Human)
Description:P14174
Residue:115
BDBM50206094
NameBDBM50206094
Synonyms:CHEMBL3960793
TypeSmall organic molecule
Emp. Form.C23H21F4N5O5
Mol. Mass.523.437
SMILESOC(=O)C(F)(F)F.NCCOCCOc1ccc2nc(ccc2c1)-c1cn(nn1)-c1ccc(O)c(F)c1