Reaction Details
Target5-hydroxytryptamine receptor 3A
LigandBDBM50206265
Substrate/Competitorn/a
Meas. Tech.ChEMBL_1628644 (CHEMBL3871229)
IC50 1600±n/a nM
Citation Hill, MDFang, HKing, HDIwuagwu, CIMcDonald, IMCook, JZusi, FCMate, RAKnox, RJPost-Munson, DEaston, AMiller, RLentz, KClarke, WBenitex, YLodge, NZaczek, RDenton, RMorgan, DBristow, LMacor, JEOlson, R Development of 4-Heteroarylamino-1'-azaspiro[oxazole-5,3'-bicyclo[2.2.2]octanes] asa7 Nicotinic Receptor Agonists. ACS Med Chem Lett8:133-137 (2017) 
 
5-hydroxytryptamine receptor 3A
Name:5-hydroxytryptamine receptor 3A
Type:Protein
Mol. Mass.:55283.27
Organism:Homo sapiens (Human)
Description:P46098
Residue:478
BDBM50206265
NameBDBM50206265
Synonyms:CHEMBL3909084
TypeSmall organic molecule
Emp. Form.C18H20N4O
Mol. Mass.308.3776
SMILESC1N=C(Nc2nccc3ccccc23)O[C@]11CN2CCC1CC2