Reaction Details
TargetNeuraminidase
LigandBDBM50206326
Substrate/Competitorn/a
Meas. Tech.ChEMBL_1628824 (CHEMBL3871450)
IC50 2.3±n/a nM
Citation Das, AAdak, AKPonnapalli, KLin, CHHsu, KCYang, JMHsu, TALin, CC Design and synthesis of 1,2,3-triazole-containing N-acyl zanamivir analogs as potent neuraminidase inhibitors. Eur J Med Chem123:397-406 (2016) 
 
Neuraminidase
Name:Neuraminidase
Type:PROTEIN
Mol. Mass.:49687.56
Organism:Influenza A virus (strain A/Wilson-Smith/1933 H1N1) (Influenza A virus(strain A/WS/1933 H1N1))
Description:ChEMBL_881601
Residue:453
BDBM50206326
NameBDBM50206326
Synonyms:CHEMBL3973923
TypeSmall organic molecule
Emp. Form.C22H33N7O8
Mol. Mass.523.5395
SMILES[H][C@]1(OC(=C[C@H](NC(=N)NC(=O)Cn2cc(nn2)C2CCCCC2)[C@H]1NC(C)=O)C(O)=O)[C@H](O)[C@H](O)CO