Reaction Details
TargetAurora kinase C
LigandBDBM50004205
Substrate/Competitorn/a
Meas. Tech.ChEMBL_1628971 (CHEMBL3871597)
Ki 4.6±n/a nM
Citation Chang, CFLin, WHKe, YYLin, YSWang, WCChen, CHKuo, PCHsu, JTAUang, BJHsieh, HP Discovery of novel inhibitors of Aurora kinases with indazole scaffold: In silico fragment-based and knowledge-based drug design. Eur J Med Chem124:186-199 (2016) 
 
Aurora kinase C
Name:Aurora kinase C
Type:Enzyme
Mol. Mass.:35602.43
Organism:Homo sapiens (Human)
Description:Amino acid residues 1-309 were expressed as His-tagged fusion protein using baculovirus expression system.
Residue:309
BDBM50004205
NameBDBM50004205
Synonyms:MK-045 TOZASERTIB VX-68 | VX-680
TypeSmall organic molecule
Emp. Form.C23H28N8OS
Mol. Mass.464.586
SMILESCN1CCN(CC1)c1cc(Nc2cc(C)[nH]n2)nc(Sc2ccc(NC(=O)C3CC3)cc2)n1