Reaction Details
TargetVascular endothelial growth factor receptor 3
LigandBDBM50206389
Substrate/Competitorn/a
Meas. Tech.ChEMBL_1628977 (CHEMBL3871603)
IC50 0.100000±n/a nM
Citation Chang, CFLin, WHKe, YYLin, YSWang, WCChen, CHKuo, PCHsu, JTAUang, BJHsieh, HP Discovery of novel inhibitors of Aurora kinases with indazole scaffold: In silico fragment-based and knowledge-based drug design. Eur J Med Chem124:186-199 (2016) 
 
Vascular endothelial growth factor receptor 3
Name:Vascular endothelial growth factor receptor 3
Type:Protein
Mol. Mass.:152749.58
Organism:Homo sapiens (Human)
Description:P35916-2
Residue:1363
BDBM50206389
NameBDBM50206389
Synonyms:CHEMBL3939307
TypeSmall organic molecule
Emp. Form.C22H20N4OS
Mol. Mass.388.485
SMILESCNC(=O)c1ccccc1Sc1ccc2c(CCc3ccccn3)n[nH]c2c1