Reaction Details
TargetAurora kinase A
LigandBDBM50206411
Substrate/Competitorn/a
Meas. Tech.ChEMBL_1628978 (CHEMBL3871604)
IC50 2860±n/a nM
Citation Chang, CFLin, WHKe, YYLin, YSWang, WCChen, CHKuo, PCHsu, JTAUang, BJHsieh, HP Discovery of novel inhibitors of Aurora kinases with indazole scaffold: In silico fragment-based and knowledge-based drug design. Eur J Med Chem124:186-199 (2016) 
 
Aurora kinase A
Name:Aurora kinase A
Type:Serine/threonine-protein kinase
Mol. Mass.:45830.98
Organism:Homo sapiens (Human)
Description:O14965
Residue:403
BDBM50206411
NameBDBM50206411
Synonyms:CHEMBL3901743
TypeSmall organic molecule
Emp. Form.C19H18N4O2
Mol. Mass.334.3718
SMILESCCNC(=O)\C=C/C(=O)Nc1cccc(c1)-c1n[nH]c2ccccc12