Reaction Details
TargetAurora kinase A
LigandBDBM50206414
Substrate/Competitorn/a
Meas. Tech.ChEMBL_1628978 (CHEMBL3871604)
IC50 314±n/a nM
Citation Chang, CFLin, WHKe, YYLin, YSWang, WCChen, CHKuo, PCHsu, JTAUang, BJHsieh, HP Discovery of novel inhibitors of Aurora kinases with indazole scaffold: In silico fragment-based and knowledge-based drug design. Eur J Med Chem124:186-199 (2016) 
 
Aurora kinase A
Name:Aurora kinase A
Type:Serine/threonine-protein kinase
Mol. Mass.:45830.98
Organism:Homo sapiens (Human)
Description:O14965
Residue:403
BDBM50206414
NameBDBM50206414
Synonyms:CHEMBL3935219
TypeSmall organic molecule
Emp. Form.C26H26N4O5S
Mol. Mass.506.573
SMILESCC(C)OC(=O)CCC(=O)Nc1cccc(c1)-c1n[nH]c2ccc(NS(=O)(=O)c3ccccc3)cc12