Reaction Details
TargetAurora kinase B
LigandBDBM50206391
Substrate/Competitorn/a
Meas. Tech.ChEMBL_1628980 (CHEMBL3871606)
IC50 31±n/a nM
Citation Chang, CFLin, WHKe, YYLin, YSWang, WCChen, CHKuo, PCHsu, JTAUang, BJHsieh, HP Discovery of novel inhibitors of Aurora kinases with indazole scaffold: In silico fragment-based and knowledge-based drug design. Eur J Med Chem124:186-199 (2016) 
 
Aurora kinase B
Name:Aurora kinase B
Type:Protein
Mol. Mass.:39327.72
Organism:Homo sapiens (Human)
Description:Q96GD4
Residue:344
BDBM50206391
NameBDBM50206391
Synonyms:CHEMBL3894492
TypeSmall organic molecule
Emp. Form.C24H20N4O6S
Mol. Mass.492.504
SMILESCOc1ccc(cc1)S(=O)(=O)Nc1ccc2[nH]nc(-c3cccc(NC(=O)\C=C/C(O)=O)c3)c2c1