Reaction Details
TargetInduced myeloid leukemia cell differentiation protein Mcl-1
LigandBDBM50206517
Substrate/Competitorn/a
Meas. Tech.ChEMBL_1629122 (CHEMBL3871748)
Ki 220±n/a nM
Citation Wan, YLiu, TLi, XChen, CFang, H Improved binding affinities of pyrrolidine derivatives as Mcl-1 inhibitors by modifying amino acid side chains. Bioorg Med Chem25:138-152 (2017) 
 
Induced myeloid leukemia cell differentiation protein Mcl-1
Name:Induced myeloid leukemia cell differentiation protein Mcl-1
Type:Membrane; Single-pass membrane protein
Mol. Mass.:37332.87
Organism:Homo sapiens (Human)
Description:Q07820
Residue:350
BDBM50206517
NameBDBM50206517
Synonyms:CHEMBL3908357
TypeSmall organic molecule
Emp. Form.C44H42Cl2N4O10S
Mol. Mass.889.796
SMILESCC(C)(C)OC(=O)N1C[C@H](C[C@H]1C(=O)N[C@@H](Cc1ccc(OCc2ccccc2)cc1)C(=O)NS(=O)(=O)c1ccc(Cl)c(c1)[N+]([O-])=O)Oc1ccc(cc1)-c1ccc(Cl)cc1