Reaction Details
TargetKynurenine 3-monooxygenase
LigandBDBM50206575
Substrate/Competitorn/a
Meas. Tech.ChEBML_1629193
IC50 0.900000±n/a nM
Citation Amin, SAAdhikari, NJha, TGayen, S First molecular modeling report on novel arylpyrimidine kynurenine monooxygenase inhibitors through multi-QSAR analysis against Huntington's disease: A proposal to chemists! Bioorg Med Chem Lett26:5712-5718 (2016) 
 
Kynurenine 3-monooxygenase
Name:Kynurenine 3-monooxygenase
Type:PROTEIN
Mol. Mass.:55831.03
Organism:Homo sapiens (Human)
Description:ChEMBL_1487479
Residue:486
BDBM50206575
NameBDBM50206575
Synonyms:CHEMBL3930333
TypeSmall organic molecule
Emp. Form.C12H9FN2O2
Mol. Mass.232.2105
SMILESCc1ccc(cc1F)-c1ccnc(n1)C(O)=O