Reaction Details
TargetKynurenine 3-monooxygenase
LigandBDBM50206604
Substrate/Competitorn/a
Meas. Tech.ChEBML_1629193
IC50 0.200000±n/a nM
Citation Amin, SAAdhikari, NJha, TGayen, S First molecular modeling report on novel arylpyrimidine kynurenine monooxygenase inhibitors through multi-QSAR analysis against Huntington's disease: A proposal to chemists! Bioorg Med Chem Lett26:5712-5718 (2016) 
 
Kynurenine 3-monooxygenase
Name:Kynurenine 3-monooxygenase
Type:PROTEIN
Mol. Mass.:55831.03
Organism:Homo sapiens (Human)
Description:ChEMBL_1487479
Residue:486
BDBM50206604
NameBDBM50206604
Synonyms:CHEMBL3931822
TypeSmall organic molecule
Emp. Form.C11H6ClFN2O2
Mol. Mass.252.629
SMILESOC(=O)c1nccc(n1)-c1cccc(Cl)c1F