Reaction Details
TargetKynurenine 3-monooxygenase
LigandBDBM50206608
Substrate/Competitorn/a
Meas. Tech.ChEBML_1629193
IC50 2.1±n/a nM
Citation Amin, SAAdhikari, NJha, TGayen, S First molecular modeling report on novel arylpyrimidine kynurenine monooxygenase inhibitors through multi-QSAR analysis against Huntington's disease: A proposal to chemists! Bioorg Med Chem Lett26:5712-5718 (2016) 
 
Kynurenine 3-monooxygenase
Name:Kynurenine 3-monooxygenase
Type:PROTEIN
Mol. Mass.:55831.03
Organism:Homo sapiens (Human)
Description:ChEMBL_1487479
Residue:486
BDBM50206608
NameBDBM50206608
Synonyms:CHEMBL3915370
TypeSmall organic molecule
Emp. Form.C12H6ClF3N2O3
Mol. Mass.318.636
SMILESOC(=O)c1nccc(n1)-c1ccc(OC(F)(F)F)c(Cl)c1