Reaction Details
TargetKynurenine 3-monooxygenase
LigandBDBM50206628
Substrate/Competitorn/a
Meas. Tech.ChEMBL_1629193 (CHEMBL3871819)
IC50 0.300000±n/a nM
Citation Amin, SAAdhikari, NJha, TGayen, S First molecular modeling report on novel arylpyrimidine kynurenine monooxygenase inhibitors through multi-QSAR analysis against Huntington's disease: A proposal to chemists! Bioorg Med Chem Lett26:5712-5718 (2016) 
 
Kynurenine 3-monooxygenase
Name:Kynurenine 3-monooxygenase
Type:PROTEIN
Mol. Mass.:55831.03
Organism:Homo sapiens (Human)
Description:ChEMBL_1487479
Residue:486
BDBM50206628
NameBDBM50206628
Synonyms:CHEMBL3921825
TypeSmall organic molecule
Emp. Form.C11H7FN2O2
Mol. Mass.218.1839
SMILESOC(=O)c1nccc(n1)-c1cccc(F)c1