Reaction Details
TargetKynurenine 3-monooxygenase
LigandBDBM50206616
Substrate/Competitorn/a
Meas. Tech.ChEMBL_1629193 (CHEMBL3871819)
IC50 1.2±n/a nM
Citation Amin, SAAdhikari, NJha, TGayen, S First molecular modeling report on novel arylpyrimidine kynurenine monooxygenase inhibitors through multi-QSAR analysis against Huntington's disease: A proposal to chemists! Bioorg Med Chem Lett26:5712-5718 (2016) 
 
Kynurenine 3-monooxygenase
Name:Kynurenine 3-monooxygenase
Type:PROTEIN
Mol. Mass.:55831.03
Organism:Homo sapiens (Human)
Description:ChEMBL_1487479
Residue:486
BDBM50206616
NameBDBM50206616
Synonyms:CHEMBL3983459
TypeSmall organic molecule
Emp. Form.C12H9ClN2O3
Mol. Mass.264.664
SMILESCOc1ccc(cc1Cl)-c1ccnc(n1)C(O)=O