Reaction Details
Target5-hydroxytryptamine receptor 2C
LigandBDBM50206724
Substrate/Competitorn/a
Meas. Tech.ChEMBL_1629227 (CHEMBL3871853)
Ki 0.630957±n/a nM
Citation Schrader, TOKasem, MRen, AFeichtinger, KAl Doori, BWei, JWu, CDang, HLe, MGatlin, JChase, KDong, JWhelan, KTSage, CGrottick, AJSemple, G Tetrahydroquinoline-based tricyclic amines as potent and selective agonists of the 5-HT Bioorg Med Chem Lett26:5877-5882 (2016) 
 
5-hydroxytryptamine receptor 2C
Name:5-hydroxytryptamine receptor 2C
Type:G Protein-Coupled Receptor (GPCR)
Mol. Mass.:51836.79
Organism:Homo sapiens (Human)
Description:P28335
Residue:458
BDBM50206724
NameBDBM50206724
Synonyms:CHEMBL3912721
TypeSmall organic molecule
Emp. Form.C17H24N2
Mol. Mass.256.3859
SMILESC(C1CCC1)c1cccc2N3CCNCC3CCc12