Reaction Details
TargetSodium-dependent serotonin transporter
LigandBDBM50206789
Substrate/Competitorn/a
Meas. Tech.ChEMBL_1629249 (CHEMBL3871875)
Ki<100±n/a nM
Citation Yoshinaga, HMasumoto, SKoyama, KKinomura, NMatsumoto, YKato, TBaba, SMatsumoto, KHorisawa, TOki, HYabuuchi, KKodo, T Discovery of SMP-304, a novel benzylpiperidine derivative with serotonin transporter inhibitory activity and 5-HT Bioorg Med Chem25:293-304 (2017) 
 
Sodium-dependent serotonin transporter
Name:Sodium-dependent serotonin transporter
Type:Multi-pass membrane protein
Mol. Mass.:70322.51
Organism:Homo sapiens (Human)
Description:P31645
Residue:630
BDBM50206789
NameBDBM50206789
Synonyms:CHEMBL3981001
TypeSmall organic molecule
Emp. Form.C26H35FN2O3
Mol. Mass.442.5661
SMILESCOc1ccc(F)c(CC2CCN(CC2)C2CCN(CC2)c2ccc(OC)c(OC)c2)c1