Reaction Details
TargetSodium-dependent serotonin transporter
LigandBDBM50206784
Substrate/Competitorn/a
Meas. Tech.ChEMBL_1629237 (CHEMBL3871863)
Ki 62±n/a nM
Citation Yoshinaga, HMasumoto, SKoyama, KKinomura, NMatsumoto, YKato, TBaba, SMatsumoto, KHorisawa, TOki, HYabuuchi, KKodo, T Discovery of SMP-304, a novel benzylpiperidine derivative with serotonin transporter inhibitory activity and 5-HT Bioorg Med Chem25:293-304 (2017) 
 
Sodium-dependent serotonin transporter
Name:Sodium-dependent serotonin transporter
Type:Multi-pass membrane protein
Mol. Mass.:70322.51
Organism:Homo sapiens (Human)
Description:P31645
Residue:630
BDBM50206784
NameBDBM50206784
Synonyms:CHEMBL3913057
TypeSmall organic molecule
Emp. Form.C21H25BrClNO
Mol. Mass.422.786
SMILESCOc1ccc(Br)c(CC2CCN(CCc3ccccc3Cl)CC2)c1