Reaction Details
TargetSodium-dependent serotonin transporter
LigandBDBM86420
Substrate/Competitorn/a
Meas. Tech.ChEMBL_1629249 (CHEMBL3871875)
Ki 22±n/a nM
Citation Yoshinaga, HMasumoto, SKoyama, KKinomura, NMatsumoto, YKato, TBaba, SMatsumoto, KHorisawa, TOki, HYabuuchi, KKodo, T Discovery of SMP-304, a novel benzylpiperidine derivative with serotonin transporter inhibitory activity and 5-HT Bioorg Med Chem25:293-304 (2017) 
 
Sodium-dependent serotonin transporter
Name:Sodium-dependent serotonin transporter
Type:Multi-pass membrane protein
Mol. Mass.:70322.51
Organism:Homo sapiens (Human)
Description:P31645
Residue:630
BDBM86420
NameBDBM86420
Synonyms:CAS_92623-85-3 NSC_0
TypeSmall organic molecule
Emp. Form.C15H22N2O
Mol. Mass.246.348
SMILESCCN(CC)C(=O)[C@@]1(C[C@@H]1CN)c1ccccc1