Reaction Details
TargetSodium-dependent serotonin transporter
LigandBDBM50206788
Substrate/Competitorn/a
Meas. Tech.ChEMBL_1629237 (CHEMBL3871863)
Ki 26±n/a nM
Citation Yoshinaga, HMasumoto, SKoyama, KKinomura, NMatsumoto, YKato, TBaba, SMatsumoto, KHorisawa, TOki, HYabuuchi, KKodo, T Discovery of SMP-304, a novel benzylpiperidine derivative with serotonin transporter inhibitory activity and 5-HT Bioorg Med Chem25:293-304 (2017) 
 
Sodium-dependent serotonin transporter
Name:Sodium-dependent serotonin transporter
Type:Multi-pass membrane protein
Mol. Mass.:70322.51
Organism:Homo sapiens (Human)
Description:P31645
Residue:630
BDBM50206788
NameBDBM50206788
Synonyms:CHEMBL3949638
TypeSmall organic molecule
Emp. Form.C25H28BrNO
Mol. Mass.438.4
SMILESCOc1ccc(Br)c(CC2CCN(CCc3ccc4ccccc4c3)CC2)c1