Reaction Details
TargetCytochrome P450 3A4
LigandBDBM50343939
Substrate/Competitorn/a
Meas. Tech.ChEBML_1629312
IC50 9300±n/a nM
Citation Morioka, M 3-Cyano-6-(5-methyl-3-pyrazoloamino) pyridines (Part 2): A dual inhibitor of Aurora kinase and tubulin polymerization. Bioorg Med Chem Lett26:5860-5862 (2016) 
 
Cytochrome P450 3A4
Name:Cytochrome P450 3A4
Type:Enzyme
Mol. Mass.:57349.57
Organism:Homo sapiens (Human)
Description:n/a
Residue:503
BDBM50343939
NameBDBM50343939
Synonyms:(S)-2-(6-hydroxy-6-methylheptan-2-ylamino)-4-methyl-6-(5-methyl-1H-pyrazol-3-ylamino)nicotinonitrile | CHEMBL1778663
TypeSmall organic molecule
Emp. Form.C19H28N6O
Mol. Mass.356.4652
SMILESC[C@@H](CCCC(C)(C)O)Nc1nc(Nc2cc(C)n[nH]2)cc(C)c1C#N