Reaction Details
TargetVascular endothelial growth factor receptor 2
LigandBDBM50206819
Substrate/Competitorn/a
Meas. Tech.ChEBML_1629293
Ki 590±n/a nM
Citation Morioka, M 3-Cyano-6-(5-methyl-3-pyrazoloamino) pyridines (Part 2): A dual inhibitor of Aurora kinase and tubulin polymerization. Bioorg Med Chem Lett26:5860-5862 (2016) 
 
Vascular endothelial growth factor receptor 2
Name:Vascular endothelial growth factor receptor 2
Type:Receptor Tyrosine Kinase
Mol. Mass.:151510.97
Organism:Homo sapiens (Human)
Description:P35968
Residue:1356
BDBM50206819
NameBDBM50206819
Synonyms:CHEMBL3893914
TypeSmall organic molecule
Emp. Form.C19H21N7O
Mol. Mass.363.4163
SMILESCc1cc(Nc2cc(C)c(C#N)c(NCCOc3ccc(C)nc3)n2)n[nH]1