Reaction Details
TargetCytochrome P450 2D6
LigandBDBM50206857
Substrate/Competitorn/a
Meas. Tech.ChEBML_1629313
IC50 29000±n/a nM
Citation Morioka, M 3-Cyano-6-(5-methyl-3-pyrazoloamino) pyridines (Part 2): A dual inhibitor of Aurora kinase and tubulin polymerization. Bioorg Med Chem Lett26:5860-5862 (2016) 
 
Cytochrome P450 2D6
Name:Cytochrome P450 2D6
Type:Protein
Mol. Mass.:55774.82
Organism:Homo sapiens (Human)
Description:P10635
Residue:497
BDBM50206857
NameBDBM50206857
Synonyms:CHEMBL3922893
TypeSmall organic molecule
Emp. Form.C18H19N7O
Mol. Mass.349.3898
SMILESCc1cc(Nc2cc(C)c(C#N)c(NCCOc3ccccn3)n2)n[nH]1