Reaction Details
TargetCytochrome P450 2C9
LigandBDBM50206862
Substrate/Competitorn/a
Meas. Tech.ChEBML_1629311
IC50 3500±n/a nM
Citation Morioka, M 3-Cyano-6-(5-methyl-3-pyrazoloamino) pyridines (Part 2): A dual inhibitor of Aurora kinase and tubulin polymerization. Bioorg Med Chem Lett26:5860-5862 (2016) 
 
Cytochrome P450 2C9
Name:Cytochrome P450 2C9
Type:Enzyme
Mol. Mass.:55636.33
Organism:Homo sapiens (Human)
Description:P11712
Residue:490
BDBM50206862
NameBDBM50206862
Synonyms:CHEMBL3967136
TypeSmall organic molecule
Emp. Form.C20H23N7O
Mol. Mass.377.4429
SMILESCc1cc(Nc2cc(C)c(C#N)c(NCCOc3ccc(C)nc3C)n2)n[nH]1