Reaction Details
TargetHeat shock protein HSP 90-alpha
LigandBDBM50206882
Substrate/Competitorn/a
Meas. Tech.ChEMBL_1629466 (CHEMBL3872092)
Kd 370000±n/a nM
Citation Huang, RAyine-Tora, DMMuhammad Rosdi, MNLi, YReynisson, JLeung, IKH Virtual screening and biophysical studies lead to HSP90 inhibitors. Bioorg Med Chem Lett27:277-281 (2017) 
 
Heat shock protein HSP 90-alpha
Name:Heat shock protein HSP 90-alpha
Type:Molecular Chaperone
Mol. Mass.:84623.45
Organism:Homo sapiens (Human)
Description:P07900
Residue:732
BDBM50206882
NameBDBM50206882
Synonyms:CHEMBL3936909
TypeSmall organic molecule
Emp. Form.C17H16O6
Mol. Mass.316.3053
SMILESOc1ccc(C(=O)Cc2ccc3OCCCOc3c2)c(O)c1O