Reaction Details
TargetGlucocorticoid receptor
LigandBDBM50206935
Substrate/Competitorn/a
Meas. Tech.ChEBML_1629477
IC50 91±n/a nM
Citation Jin, ZLin, HSrinivasan, SNwachukwu, JCBruno, NGriffin, PRNettles, KWKamenecka, TM Synthesis of novel steroidal agonists, partial agonists, and antagonists for the glucocorticoid receptor. Bioorg Med Chem Lett27:347-353 (2017) 
 
Glucocorticoid receptor
Name:Glucocorticoid receptor
Type:Enzyme
Mol. Mass.:85656.87
Organism:Homo sapiens (Human)
Description:P04150
Residue:777
BDBM50206935
NameBDBM50206935
Synonyms:CHEMBL3956011
TypeSmall organic molecule
Emp. Form.C25H30N2O3
Mol. Mass.406.5173
SMILES[H][C@@]12CC[C@H](O)[C@@]1(C)C[C@H](O)[C@]1([H])c3ccc(cc3CC[C@@]21[H])C(=O)Nc1ccc(C)nc1