Reaction Details
TargetGlucocorticoid receptor
LigandBDBM50206934
Substrate/Competitorn/a
Meas. Tech.ChEMBL_1629476 (CHEMBL3872102)
EC50 100±n/a nM
Citation Jin, ZLin, HSrinivasan, SNwachukwu, JCBruno, NGriffin, PRNettles, KWKamenecka, TM Synthesis of novel steroidal agonists, partial agonists, and antagonists for the glucocorticoid receptor. Bioorg Med Chem Lett27:347-353 (2017) 
 
Glucocorticoid receptor
Name:Glucocorticoid receptor
Type:Enzyme
Mol. Mass.:85656.87
Organism:Homo sapiens (Human)
Description:P04150
Residue:777
BDBM50206934
NameBDBM50206934
Synonyms:CHEMBL3937005
TypeSmall organic molecule
Emp. Form.C31H38N2O3
Mol. Mass.486.645
SMILES[H][C@@]12CC[C@@](O)(C#CCCCC)[C@@]1(C)C[C@H](O)[C@]1([H])c3ccc(cc3CC[C@@]21[H])C(=O)Nc1cccnc1C