Reaction Details
TargetGlucocorticoid receptor
LigandBDBM50206949
Substrate/Competitorn/a
Meas. Tech.ChEMBL_1629477 (CHEMBL3872103)
IC50 1357±n/a nM
Citation Jin, ZLin, HSrinivasan, SNwachukwu, JCBruno, NGriffin, PRNettles, KWKamenecka, TM Synthesis of novel steroidal agonists, partial agonists, and antagonists for the glucocorticoid receptor. Bioorg Med Chem Lett27:347-353 (2017) 
 
Glucocorticoid receptor
Name:Glucocorticoid receptor
Type:Enzyme
Mol. Mass.:85656.87
Organism:Homo sapiens (Human)
Description:P04150
Residue:777
BDBM50206949
NameBDBM50206949
Synonyms:CHEMBL3891049
TypeSmall organic molecule
Emp. Form.C28H32N2O3
Mol. Mass.444.5653
SMILES[H][C@@]12CC[C@@](O)(C#CC)[C@@]1(C)C[C@H](O)[C@]1([H])c3ccc(cc3CC[C@@]21[H])C(=O)Nc1ccncc1C