Reaction Details
TargetSteroid 21-hydroxylase
LigandBDBM50206959
Substrate/Competitorn/a
Meas. Tech.ChEMBL_1629495 (CHEMBL3872121)
IC50>10000±n/a nM
Citation Whitehead, BRLo, MMAli, APark, MKHoyt, SBXiong, YCai, JCarswell, ECooke, AMacLean, JRatcliffe, PRobinson, JBennett, DJClemas, JAWisniewski, TStruthers, MCully, DMacNeil, DJ Imidazopyridyl compounds as aldosterone synthase inhibitors. Bioorg Med Chem Lett27:143-146 (2017) 
 
Steroid 21-hydroxylase
Name:Steroid 21-hydroxylase
Type:PROTEIN
Mol. Mass.:55896.25
Organism:Homo sapiens (Human)
Description:ChEMBL_1498865
Residue:494
BDBM50206959
NameBDBM50206959
Synonyms:CHEMBL3924257
TypeSmall organic molecule
Emp. Form.C16H13F2N3
Mol. Mass.285.2913
SMILESCc1c(F)cncc1-c1nc2ccc(F)cn2c1C1CC1