Reaction Details
TargetSteroid 21-hydroxylase
LigandBDBM50206963
Substrate/Competitorn/a
Meas. Tech.ChEMBL_1629495 (CHEMBL3872121)
IC50>10000±n/a nM
Citation Whitehead, BRLo, MMAli, APark, MKHoyt, SBXiong, YCai, JCarswell, ECooke, AMacLean, JRatcliffe, PRobinson, JBennett, DJClemas, JAWisniewski, TStruthers, MCully, DMacNeil, DJ Imidazopyridyl compounds as aldosterone synthase inhibitors. Bioorg Med Chem Lett27:143-146 (2017) 
 
Steroid 21-hydroxylase
Name:Steroid 21-hydroxylase
Type:PROTEIN
Mol. Mass.:55896.25
Organism:Homo sapiens (Human)
Description:ChEMBL_1498865
Residue:494
BDBM50206963
NameBDBM50206963
Synonyms:CHEMBL3948337 | US9518055, Example 41
TypeSmall organic molecule
Emp. Form.C19H14FN3
Mol. Mass.303.333
SMILESFc1ccc2nc(c(C3CC3)n2c1)-c1cncc2ccccc12