Reaction Details
TargetD(2) dopamine receptor
LigandBDBM50207041
Substrate/Competitorn/a
Meas. Tech.ChEMBL_1629510 (CHEMBL3872136)
Ki<10000±n/a nM
Citation Saavedra, OMKarila, DBrossard, DRojas, ADupuis, DGohier, AMannoury la Cour, CMillan, MJOrtuno, JCHanessian, S Design and synthesis of novel N-sulfonyl-2-indoles that behave as 5-HT Bioorg Med Chem25:38-52 (2017) 
 
D(2) dopamine receptor
Name:D(2) dopamine receptor
Type:Cell-surface receptors
Mol. Mass.:50647.10
Organism:Homo sapiens (Human)
Description:P14416
Residue:443
BDBM50207041
NameBDBM50207041
Synonyms:CHEMBL3938498
TypeSmall organic molecule
Emp. Form.C20H20N2O2S
Mol. Mass.352.45
SMILES[H][C@@]12CCNCC[C@]1([H])c1cc3n(ccc3cc21)S(=O)(=O)c1ccccc1