Reaction Details
Target5-hydroxytryptamine receptor 6
LigandBDBM50206981
Substrate/Competitorn/a
Meas. Tech.ChEMBL_1629512 (CHEMBL3872138)
Ki 1.000000±n/a nM
Citation Saavedra, OMKarila, DBrossard, DRojas, ADupuis, DGohier, AMannoury la Cour, CMillan, MJOrtuno, JCHanessian, S Design and synthesis of novel N-sulfonyl-2-indoles that behave as 5-HT Bioorg Med Chem25:38-52 (2017) 
 
5-hydroxytryptamine receptor 6
Name:5-hydroxytryptamine receptor 6
Type:G Protein-Coupled Receptor (GPCR)
Mol. Mass.:46968.43
Organism:Homo sapiens (Human)
Description:P50406
Residue:440
BDBM50206981
NameBDBM50206981
Synonyms:CHEMBL3948819
TypeSmall organic molecule
Emp. Form.C22H20N2O2S
Mol. Mass.376.471
SMILESCNCC1Cc2ccc3n(ccc3c12)S(=O)(=O)c1cccc2ccccc12