Reaction Details
Target5-hydroxytryptamine receptor 1A
LigandBDBM50207091
Substrate/Competitorn/a
Meas. Tech.ChEBML_1630051
Ki 5.2±n/a nM
Citation Chen, XWSun, YYFu, LLi, JQ Synthesis and pharmacological characterization of novel N-(trans-4-(2-(4-(benzo[d]isothiazol-3-yl)piperazin-1-yl)ethyl)cyclohexyl)amides as potential multireceptor atypical antipsychotics. Eur J Med Chem123:332-353 (2016) 
 
5-hydroxytryptamine receptor 1A
Name:5-hydroxytryptamine receptor 1A
Type:n/a
Mol. Mass.:46122.49
Organism:Homo sapiens (Human)
Description:n/a
Residue:422
BDBM50207091
NameBDBM50207091
Synonyms:CHEMBL3953773 | US9550741, IV-6
TypeSmall organic molecule
Emp. Form.C27H35N5OS
Mol. Mass.477.665
SMILESCN(C(=O)N[C@H]1CC[C@H](CCN2CCN(CC2)c2nsc3ccccc23)CC1)c1ccccc1