Reaction Details
TargetD(3) dopamine receptor
LigandBDBM50207142
Substrate/Competitorn/a
Meas. Tech.ChEMBL_1630050 (CHEMBL3872756)
Ki 0.160000±n/a nM
Citation Chen, XWSun, YYFu, LLi, JQ Synthesis and pharmacological characterization of novel N-(trans-4-(2-(4-(benzo[d]isothiazol-3-yl)piperazin-1-yl)ethyl)cyclohexyl)amides as potential multireceptor atypical antipsychotics. Eur J Med Chem123:332-353 (2016) 
 
D(3) dopamine receptor
Name:D(3) dopamine receptor
Type:n/a
Mol. Mass.:44243.43
Organism:Homo sapiens (Human)
Description:n/a
Residue:400
BDBM50207142
NameBDBM50207142
Synonyms:CHEMBL3973487
TypeSmall organic molecule
Emp. Form.C21H30N4OS
Mol. Mass.386.554
SMILESCC(=O)N[C@H]1CC[C@H](CCN2CCN(CC2)c2nsc3ccccc23)CC1