Reaction Details
TargetD(3) dopamine receptor
LigandBDBM50207162
Substrate/Competitorn/a
Meas. Tech.ChEMBL_1630050 (CHEMBL3872756)
Ki 0.043000±n/a nM
Citation Chen, XWSun, YYFu, LLi, JQ Synthesis and pharmacological characterization of novel N-(trans-4-(2-(4-(benzo[d]isothiazol-3-yl)piperazin-1-yl)ethyl)cyclohexyl)amides as potential multireceptor atypical antipsychotics. Eur J Med Chem123:332-353 (2016) 
 
D(3) dopamine receptor
Name:D(3) dopamine receptor
Type:n/a
Mol. Mass.:44243.43
Organism:Homo sapiens (Human)
Description:n/a
Residue:400
BDBM50207162
NameBDBM50207162
Synonyms:CHEMBL3918755 | US9550741, IV-1
TypeSmall organic molecule
Emp. Form.C26H33N5OS
Mol. Mass.463.638
SMILESO=C(N[C@H]1CC[C@H](CCN2CCN(CC2)c2nsc3ccccc23)CC1)Nc1ccccc1