Reaction Details
TargetD(2) dopamine receptor
LigandBDBM50207162
Substrate/Competitorn/a
Meas. Tech.ChEMBL_1630049 (CHEMBL3872755)
Ki 0.630000±n/a nM
Citation Chen, XWSun, YYFu, LLi, JQ Synthesis and pharmacological characterization of novel N-(trans-4-(2-(4-(benzo[d]isothiazol-3-yl)piperazin-1-yl)ethyl)cyclohexyl)amides as potential multireceptor atypical antipsychotics. Eur J Med Chem123:332-353 (2016) 
 
D(2) dopamine receptor
Name:D(2) dopamine receptor
Type:Cell-surface receptors
Mol. Mass.:50647.10
Organism:Homo sapiens (Human)
Description:P14416
Residue:443
BDBM50207162
NameBDBM50207162
Synonyms:CHEMBL3918755 | US9550741, IV-1
TypeSmall organic molecule
Emp. Form.C26H33N5OS
Mol. Mass.463.638
SMILESO=C(N[C@H]1CC[C@H](CCN2CCN(CC2)c2nsc3ccccc23)CC1)Nc1ccccc1