Reaction Details
Target5-hydroxytryptamine receptor 2A
LigandBDBM50207162
Substrate/Competitorn/a
Meas. Tech.ChEMBL_1630052 (CHEMBL3872758)
Ki 0.210000±n/a nM
Citation Chen, XWSun, YYFu, LLi, JQ Synthesis and pharmacological characterization of novel N-(trans-4-(2-(4-(benzo[d]isothiazol-3-yl)piperazin-1-yl)ethyl)cyclohexyl)amides as potential multireceptor atypical antipsychotics. Eur J Med Chem123:332-353 (2016) 
 
5-hydroxytryptamine receptor 2A
Name:5-hydroxytryptamine receptor 2A
Type:undefined
Mol. Mass.:52607.65
Organism:Homo sapiens (Human)
Description:P28223
Residue:471
BDBM50207162
NameBDBM50207162
Synonyms:CHEMBL3918755 | US9550741, IV-1
TypeSmall organic molecule
Emp. Form.C26H33N5OS
Mol. Mass.463.638
SMILESO=C(N[C@H]1CC[C@H](CCN2CCN(CC2)c2nsc3ccccc23)CC1)Nc1ccccc1